Target
Farnesyl pyrophosphate synthase
Ligand
BDBM50022666
Substrate
Meas. Tech.
ChEMBL_1368841
IC50
200±n/a nM
Citation
 De Schutter, JWPark, JLeung, CYGormley, PLin, YSHu, ZBerghuis, AMPoirier, JTsantrizos, YS Multistage screening reveals chameleon ligands of the human farnesyl pyrophosphate synthase: implications to drug discovery for neurodegenerative diseases. J Med Chem 57:5764-76 (2014)  
Target
Name:
Farnesyl pyrophosphate synthase
Synonyms:
Dimethylallyltranstransferase FPP synthase FPPS_HUMAN Farnesyl diphosphate synthase Farnesyl diphosphate synthetase Farnesyl pyrophosphate synthetase KIAA1293 | P14324
Type:
Enzyme
Mol. Mass.:
48272.89
Organism:
Homo sapiens (Human)
Description:
P14324
Residue:
419
  
Inhibitor
Name:
BDBM50022666
Synonyms:
CHEMBL3299050
Type:
Small organic molecule
Emp. Form.:
C15H13N3O2S
Mol. Mass.:
299.348
SMILES:
Cc1ccc(cc1)-c1cc2c(NCC(O)=O)ncnc2s1
: