Target
Farnesyl pyrophosphate synthase
Ligand
BDBM50022663
Substrate
Meas. Tech.
ChEMBL_1368838
IC50
4500±n/a nM
Citation
 De Schutter, JWPark, JLeung, CYGormley, PLin, YSHu, ZBerghuis, AMPoirier, JTsantrizos, YS Multistage screening reveals chameleon ligands of the human farnesyl pyrophosphate synthase: implications to drug discovery for neurodegenerative diseases. J Med Chem 57:5764-76 (2014)  
Target
Name:
Farnesyl pyrophosphate synthase
Synonyms:
Dimethylallyltranstransferase FPP synthase FPPS_HUMAN Farnesyl diphosphate synthase Farnesyl diphosphate synthetase Farnesyl pyrophosphate synthetase KIAA1293 | P14324
Type:
Enzyme
Mol. Mass.:
48272.89
Organism:
Homo sapiens (Human)
Description:
P14324
Residue:
419
  
Inhibitor
Name:
BDBM50022663
Synonyms:
CHEMBL3299047
Type:
Small organic molecule
Emp. Form.:
C14H14N3O3PS
Mol. Mass.:
335.318
SMILES:
Cc1ccc(cc1)-c1cc2c(NCP(O)(O)=O)ncnc2s1
: