Target
High affinity nerve growth factor receptor
Ligand
BDBM50022678
Substrate
Meas. Tech.
ChEMBL_1368856 (CHEMBL3299478)
IC50
>100000±n/a nM
Citation
 Stachel, SJSanders, JMHenze, DARudd, MTSu, HPLi, YNanda, KKEgbertson, MSManley, PJJones, KLBrnardic, EJGreen, AGrobler, JAHanney, BLeitl, MLai, MTMunshi, VMurphy, DRickert, KRiley, DKrasowska-Zoladek, ADaley, CZuck, PKane, SABilodeau, MT Maximizing diversity from a kinase screen: identification of novel and selective pan-Trk inhibitors for chronic pain. J Med Chem 57:5800-16 (2014)  
Target
Name:
High affinity nerve growth factor receptor
Synonyms:
2.7.10.1 NTRK1 NTRK1_HUMAN Neurotrophic tyrosine kinase receptor type 1 Synonyms=MTC TRK1-transforming tyrosine kinase protein TRKA GN Tropomyosin alpha-3 chain/High affinity nerve growth factor receptor Tropomyosin-related kinase A (TrkA) Tyrosine kinase receptor (Trk) Tyrosine kinase receptor A (Trk A) Tyrosine kinase receptor A (TrkA) p140-TrkA
Type:
Mol. Mass.:
87498.18
Organism:
Homo sapiens (Human)
Description:
P04629
Residue:
796
  
Inhibitor
Name:
BDBM50022678
Synonyms:
CHEMBL3298364
Type:
Small organic molecule
Emp. Form.:
C18H14F3N3O2S
Mol. Mass.:
393.383
SMILES:
FC(F)(F)Oc1ccc(NC(=O)NCc2cccc(c2)-c2nccs2)cc1
: