Target
Metabotropic glutamate receptor 1
Ligand
BDBM50022759
Substrate
Meas. Tech.
ChEMBL_1368981
EC50
>10000±n/a nM
Citation
 Turlington, MMalosh, CJacobs, JManka, JTNoetzel, MJVinson, PNJadhav, SHerman, EJLavreysen, HMackie, CBartolomé-Nebreda, JMConde-Ceide, SMartín-Martín, MLTong, HMLópez, SMacDonald, GJSteckler, TDaniels, JSWeaver, CDNiswender, CMJones, CKConn, PJLindsley, CWStauffer, SR Tetrahydronaphthyridine and dihydronaphthyridinone ethers as positive allosteric modulators of the metabotropic glutamate receptor 5 (mGlu5). J Med Chem 57:5620-37 (2014)  
Target
Name:
Metabotropic glutamate receptor 1
Synonyms:
GRM1_RAT Grm1 Metabotropic glutamate receptor Mglur1 metabotropic glutamate 1/5-D metabotropic glutamate receptor 1 isoform alpha precursor
Type:
Enzyme Catalytic Domain
Mol. Mass.:
133240.47
Organism:
RAT
Description:
metabotropic glutamate 1/2 0 RAT::P23385
Residue:
1199
  
Inhibitor
Name:
BDBM50022759
Synonyms:
CHEMBL3298273
Type:
Small organic molecule
Emp. Form.:
C15H13FN2O2
Mol. Mass.:
272.2743
SMILES:
Fc1cccc(COc2ccc3C(=O)NCCc3n2)c1
: