Target
Aurora kinase A
Ligand
BDBM50022939
Substrate
Meas. Tech.
ChEMBL_1369125
Ki
780±n/a nM
Citation
 Burch, JDLau, KBarker, JJBrookfield, FChen, YChen, YEigenbrot, CEllebrandt, CIsmaili, MHJohnson, AKordt, DMacKinnon, CHMcEwan, PAOrtwine, DFStein, DBWang, XWinkler, DYuen, PWZhang, YZarrin, AAPei, Z Property- and structure-guided discovery of a tetrahydroindazole series of interleukin-2 inducible T-cell kinase inhibitors. J Med Chem 57:5714-27 (2014)  
Target
Name:
Aurora kinase A
Synonyms:
AIK ARK1 AURKA AYK1 Aurora kinase A (AURA) Aurora kinase A (Aurora A) Aurora-related kinase 1 BTAK Breast-tumor-amplified kinase STK15 Serine/threonine kinase 15 Serine/threonine-protein kinase aurora A hARK1
Type:
Serine/threonine-protein kinase
Mol. Mass.:
45830.98
Organism:
Homo sapiens (Human)
Description:
O14965
Residue:
403
  
Inhibitor
Name:
BDBM50022939
Synonyms:
CHEMBL3298285
Type:
Small organic molecule
Emp. Form.:
C19H18N6O
Mol. Mass.:
346.3858
SMILES:
O=C(Nc1cnn(Cc2cccc(c2)C#N)c1)c1n[nH]c2CCCCc12
: