Target
Tyrosine-protein kinase ITK/TSK
Ligand
BDBM50022934
Substrate
Meas. Tech.
ChEMBL_1369123
Ki
0.700000±n/a nM
Citation
 Burch, JDLau, KBarker, JJBrookfield, FChen, YChen, YEigenbrot, CEllebrandt, CIsmaili, MHJohnson, AKordt, DMacKinnon, CHMcEwan, PAOrtwine, DFStein, DBWang, XWinkler, DYuen, PWZhang, YZarrin, AAPei, Z Property- and structure-guided discovery of a tetrahydroindazole series of interleukin-2 inducible T-cell kinase inhibitors. J Med Chem 57:5714-27 (2014)  
Target
Name:
Tyrosine-protein kinase ITK/TSK
Synonyms:
EMT ITK_HUMAN LYK Tyrosine-protein kinase ITK Tyrosine-protein kinase Lyk
Type:
Protein
Mol. Mass.:
71839.20
Organism:
Homo sapiens (Human)
Description:
Q08881
Residue:
620
  
Inhibitor
Name:
BDBM50022934
Synonyms:
CHEMBL3298375
Type:
Small organic molecule
Emp. Form.:
C25H34N6O
Mol. Mass.:
434.5771
SMILES:
CN(C)CC[C@@H](c1cccc(C)c1)n1cc(NC(=O)c2n[nH]c3CC(C)(C)CCc23)cn1
: