Target
Aminopeptidase N
Ligand
BDBM50023152
Substrate
Meas. Tech.
ChEMBL_1367182
Ki
55±n/a nM
Citation
 Poras, HBonnard, EDangé, EFournié-Zaluski, MCRoques, BP New orally active dual enkephalinase inhibitors (DENKIs) for central and peripheral pain treatment. J Med Chem 57:5748-63 (2014)  
Target
Name:
Aminopeptidase N
Synonyms:
AMPN_HUMAN APN Aminopeptidase CD_antigen=CD13 Myeloid plasma membrane glycoprotein CD13 gp150 | hAPN
Type:
PROTEIN
Mol. Mass.:
109522.63
Organism:
Homo sapiens (Human)
Description:
ChEMBL_1507526
Residue:
967
  
Inhibitor
Name:
BDBM50023152
Synonyms:
CHEMBL3298947
Type:
Small organic molecule
Emp. Form.:
C7H14F3NO3S
Mol. Mass.:
249.251
SMILES:
[O-]C(=O)C(F)(F)F.CCOC[C@H]([NH3+])CS
: