Target
Sodium- and chloride-dependent glycine transporter 2
Ligand
BDBM50023866
Substrate
Meas. Tech.
ChEMBL_1435206 (CHEMBL3390091)
IC50
66±n/a nM
Citation
 Takahashi, EArai, TAkahira, MNakajima, MNishimura, KOmori, YKumagai, HSuzuki, THayashi, R The discovery of potent glycine transporter type-2 inhibitors: design and synthesis of phenoxymethylbenzamide derivatives. Bioorg Med Chem Lett 24:4603-6 (2014)  
Target
Name:
Sodium- and chloride-dependent glycine transporter 2
Synonyms:
GLYT2 NET1 SLC6A5 | Sodium- and chloride-dependent glycine transporter 2
Type:
Enzyme Catalytic Domain
Mol. Mass.:
87438.56
Organism:
Homo sapiens (Human)
Description:
Glycine-2-transporter 0 HUMAN::Q9Y345
Residue:
797
  
Inhibitor
Name:
BDBM50023866
Synonyms:
CHEMBL3325509
Type:
Small organic molecule
Emp. Form.:
C22H25F3N2O3
Mol. Mass.:
422.4407
SMILES:
OCCN1CCC(CC1)NC(=O)c1ccc(COc2ccc(cc2)C(F)(F)F)cc1
: