Target
5-hydroxytryptamine receptor 1A
Ligand
BDBM50024644
Substrate
Meas. Tech.
ChEMBL_1438099 (CHEMBL3387900)
Ki
220±n/a nM
Citation
 Kumar, JSMajo, VJPrabhakaran, JMann, JJ Synthesis and evaluation of arylpiperazines derivatives of 3,5-dioxo-(2H,4H)-1,2,4-triazine as 5-HT1AR ligands. Bioorg Med Chem Lett 24:4759-62 (2014)  
Target
Name:
5-hydroxytryptamine receptor 1A
Synonyms:
5-HT-1A 5-hydroxytryptamine receptor 1A (5-HT-1A) ADRB2RL1 Dopamine D2 receptor and serotonin 1a receptor HTR1A | Serotonin receptor 1A
Type:
Mol. Mass.:
46122.49
Organism:
Homo sapiens (Human)
Description:
Residue:
422
  
Inhibitor
Name:
BDBM50024644
Synonyms:
CHEMBL3330602
Type:
Small organic molecule
Emp. Form.:
C19H28N6O2
Mol. Mass.:
372.4646
SMILES:
CNc1ccccc1N1CCN(CCCCn2ncc(=O)n(C)c2=O)CC1
: