Target
Aminopeptidase N
Ligand
BDBM50129684
Substrate
Meas. Tech.
ChEMBL_1442054 (CHEMBL3373422)
Ki
2.0±n/a nM
Citation
 Vassiliou, SWeglarz-Tomczak, EBerlicki, LPawelczak, MNocek, BMulligan, RJoachimiak, AMucha, A Structure-guided, single-point modifications in the phosphinic dipeptide structure yield highly potent and selective inhibitors of neutral aminopeptidases. J Med Chem 57:8140-51 (2014)  
Target
Name:
Aminopeptidase N
Synonyms:
AMPN_HUMAN APN Aminopeptidase CD_antigen=CD13 Myeloid plasma membrane glycoprotein CD13 gp150 | hAPN
Type:
PROTEIN
Mol. Mass.:
109522.63
Organism:
Homo sapiens (Human)
Description:
ChEMBL_1507526
Residue:
967
  
Inhibitor
Name:
BDBM50129684
Synonyms:
3-[(1-amino-3-phenyl-propyl)-hydroxy-phosphinoyl]-2-benzyl-propionic acid | CHEMBL327844
Type:
Small organic molecule
Emp. Form.:
C19H24NO4P
Mol. Mass.:
361.3719
SMILES:
OC(=O)C(Cc1ccccc1)CP(O)(O)C(=N)CCc1ccccc1
: