Target
Aminopeptidase N
Ligand
BDBM50024597
Substrate
Meas. Tech.
ChEMBL_1442055 (CHEMBL3373423)
Ki
192±n/a nM
Citation
 Vassiliou, SWeglarz-Tomczak, EBerlicki, LPawelczak, MNocek, BMulligan, RJoachimiak, AMucha, A Structure-guided, single-point modifications in the phosphinic dipeptide structure yield highly potent and selective inhibitors of neutral aminopeptidases. J Med Chem 57:8140-51 (2014)  
Target
Name:
Aminopeptidase N
Synonyms:
AMPN_PIG AP-M Alanyl aminopeptidase Aminopeptidase N (APN) Microsomal aminopeptidase pAPN
Type:
Protein
Mol. Mass.:
108810.25
Organism:
Sus scrofa (Pig)
Description:
P15145
Residue:
963
  
Inhibitor
Name:
BDBM50024597
Synonyms:
(S)-1-Ammonium-3-methyl-butane-1-phosphonic acid anion | CHEMBL288165
Type:
Small organic molecule
Emp. Form.:
C5H14NO3P
Mol. Mass.:
167.1433
SMILES:
CC(C)C[C@@H]([NH3+])P(O)([O-])=O
: