Target
Aminopeptidase N
Ligand
BDBM50316049
Substrate
Meas. Tech.
ChEMBL_1442055 (CHEMBL3373423)
Ki
4.0±n/a nM
Citation
 Vassiliou, SWeglarz-Tomczak, EBerlicki, LPawelczak, MNocek, BMulligan, RJoachimiak, AMucha, A Structure-guided, single-point modifications in the phosphinic dipeptide structure yield highly potent and selective inhibitors of neutral aminopeptidases. J Med Chem 57:8140-51 (2014)  
Target
Name:
Aminopeptidase N
Synonyms:
AMPN_PIG AP-M Alanyl aminopeptidase Aminopeptidase N (APN) Microsomal aminopeptidase pAPN
Type:
Protein
Mol. Mass.:
108810.25
Organism:
Sus scrofa (Pig)
Description:
P15145
Residue:
963
  
Inhibitor
Name:
BDBM50316049
Synonyms:
1-amino-3-phenylpropylphosphonic acid | CHEMBL1090914
Type:
Small organic molecule
Emp. Form.:
C9H14NO3P
Mol. Mass.:
215.1861
SMILES:
NC(CCc1ccccc1)P(O)(O)=O
: