Target
5-hydroxytryptamine receptor 2A
Ligand
BDBM50331286
Substrate
Meas. Tech.
ChEMBL_1442874 (CHEMBL3377152)
EC50
4.1±n/a nM
Citation
 Blough, BELandavazo, APartilla, JSDecker, AMPage, KMBaumann, MHRothman, RB Alpha-ethyltryptamines as dual dopamine-serotonin releasers. Bioorg Med Chem Lett 24:4754-8 (2014)  
Target
Name:
5-hydroxytryptamine receptor 2A
Synonyms:
5-HT-2 5-HT2A 5-hydroxytryptamine receptor 2A (5HT-2A) 5HT2A_HUMAN HTR2A | Serotonin receptor 2A
Type:
undefined
Mol. Mass.:
52607.65
Organism:
Homo sapiens (Human)
Description:
P28223
Residue:
471
  
Inhibitor
Name:
BDBM50331286
Synonyms:
2-(5-chloro-1H-indol-3-yl)ethanamine CHEMBL1288716
Type:
Small organic molecule
Emp. Form.:
C10H11ClN2
Mol. Mass.:
194.661
SMILES:
NCCc1c[nH]c2ccc(Cl)cc12
: