Target
Acetylcholinesterase
Ligand
BDBM50026058
Substrate
Meas. Tech.
ChEMBL_1438923 (CHEMBL3382434)
IC50
4150±n/a nM
Citation
 Liu, HRHuang, XQLou, DHLiu, XJLiu, WKWang, QA Synthesis and acetylcholinesterase inhibitory activity of Mannich base derivatives flavokawain B. Bioorg Med Chem Lett 24:4749-53 (2014)  
Target
Name:
Acetylcholinesterase
Synonyms:
ACES_RAT Acetylcholinesterase and butyrylcholinesterase (AChE and BChE) Acetylcholinesterase, AChE | Ache
Type:
Enzyme
Mol. Mass.:
68193.62
Organism:
Rattus norvegicus (rat)
Description:
P37136
Residue:
614
  
Inhibitor
Name:
BDBM50026058
Synonyms:
CHEMBL3335259
Type:
Small organic molecule
Emp. Form.:
C23H27NO4
Mol. Mass.:
381.4648
SMILES:
COc1cc(OC)c(C(=O)\C=C\c2ccccc2)c(O)c1CN1CCCCC1
: