Target
Adenosine receptor A2a
Ligand
BDBM50026818
Substrate
Meas. Tech.
ChEMBL_1438227 (CHEMBL3390259)
Kd
3.2±n/a nM
Citation
 Moss, SMJayasekara, PSPaoletta, SGao, ZGJacobson, KA Structure-Based Design of Reactive Nucleosides for Site-Specific Modification of the A2A Adenosine Receptor. ACS Med Chem Lett 5:1043-8 (2014)  
Target
Name:
Adenosine receptor A2a
Synonyms:
A2A adenosine receptor (hA2A) ADENOSINE A2 ADORA2 Adenosine A2A receptor (A2AAR)
Type:
G Protein-Coupled Receptor (GPCR)
Mol. Mass.:
44716.46
Organism:
Homo sapiens (Human)
Description:
P29274
Residue:
412
  
Inhibitor
Name:
BDBM50026818
Synonyms:
CHEMBL3335524
Type:
Small organic molecule
Emp. Form.:
C34H40N12O9
Mol. Mass.:
760.7564
SMILES:
CCNC(=O)[C@H]1O[C@H]([C@H](O)[C@@H]1O)n1cnc2c(N)nc(NCCc3ccc(CCC(=O)Nc4ccc(OC(=O)CCCCN=[N+]=[N-])c(c4)[N+]([O-])=O)cc3)nc12
: