Target
Alpha-2A adrenergic receptor
Ligand
BDBM50026816
Substrate
Meas. Tech.
ChEMBL_1438231 (CHEMBL3390263)
Kd
1.0±n/a nM
Citation
 Moss, SMJayasekara, PSPaoletta, SGao, ZGJacobson, KA Structure-Based Design of Reactive Nucleosides for Site-Specific Modification of the A2A Adenosine Receptor. ACS Med Chem Lett 5:1043-8 (2014)  
Target
Name:
Alpha-2A adrenergic receptor
Synonyms:
ADA2A_HUMAN ADRA2R Adrenergic alpha2A Alpha-2 adrenergic receptor subtype C10 Alpha-2A adrenoreceptor alpha-2A adrenergic receptor [Homo sapiens]
Type:
Enzyme
Mol. Mass.:
48979.91
Organism:
Homo sapiens (Human)
Description:
P08913
Residue:
450
  
Inhibitor
Name:
BDBM50026816
Synonyms:
CHEMBL3335523
Type:
Small organic molecule
Emp. Form.:
C31H35N9O9
Mol. Mass.:
677.6645
SMILES:
CCNC(=O)[C@H]1O[C@H]([C@H](O)[C@@H]1O)n1cnc2c(N)nc(NCCc3ccc(CCC(=O)Nc4ccc(OC(C)=O)c(c4)[N+]([O-])=O)cc3)nc12
: