Target
cAMP-specific 3',5'-cyclic phosphodiesterase 4D
Ligand
BDBM50026821
Substrate
Meas. Tech.
ChEMBL_1438244 (CHEMBL3390276)
IC50
>10000±n/a nM
Citation
 Buijnsters, PDe Angelis, MLanglois, XRombouts, FJSanderson, WTresadern, GRitchie, ATrabanco, AAVanHoof, GRoosbroeck, YVAndrés, JI Structure-Based Design of a Potent, Selective, and Brain Penetrating PDE2 Inhibitor with Demonstrated Target Engagement. ACS Med Chem Lett 5:1049-53 (2014)  
Target
Name:
cAMP-specific 3',5'-cyclic phosphodiesterase 4D
Synonyms:
3',5'-cyclic phosphodiesterase PDE43 PDE4D_HUMAN | Phosphodiesterase 4D
Type:
Protein
Mol. Mass.:
91092.69
Organism:
Homo sapiens (Human)
Description:
Q08499
Residue:
809
  
Inhibitor
Name:
BDBM50026821
Synonyms:
CHEMBL3331521 US9669035, B-1b
Type:
Small organic molecule
Emp. Form.:
C24H28N6O2
Mol. Mass.:
432.5181
SMILES:
CCCCOc1cncc(c1)-c1nnc2c(C)nc3ccc(CN4CCOCC4)cc3n12
: