Target
cAMP and cAMP-inhibited cGMP 3',5'-cyclic phosphodiesterase 10A
Ligand
BDBM50026829
Substrate
Meas. Tech.
ChEMBL_1438239 (CHEMBL3390271)
IC50
266±n/a nM
Citation
 Buijnsters, PDe Angelis, MLanglois, XRombouts, FJSanderson, WTresadern, GRitchie, ATrabanco, AAVanHoof, GRoosbroeck, YVAndrés, JI Structure-Based Design of a Potent, Selective, and Brain Penetrating PDE2 Inhibitor with Demonstrated Target Engagement. ACS Med Chem Lett 5:1049-53 (2014)  
Target
Name:
cAMP and cAMP-inhibited cGMP 3',5'-cyclic phosphodiesterase 10A
Synonyms:
PDE10_RAT Phosphodiesterase 10 Phosphodiesterase Type 10 (PDE10A) | Rat recombinant PDE10a (rPDE10a)
Type:
Enzyme
Mol. Mass.:
90160.88
Organism:
Rattus norvegicus (rat)
Description:
PDE10A was generated from the full-length recombinant rat clone transfected into Sf9 cells.
Residue:
794
  
Inhibitor
Name:
BDBM50026829
Synonyms:
CHEMBL3331514 | US9669035, B-7
Type:
Small organic molecule
Emp. Form.:
C23H24ClN5O2
Mol. Mass.:
437.922
SMILES:
CCOc1ccc(Cl)c(c1)-c1nnc2c(C)nc3ccc(CN4CCOCC4)cc3n12
: