Target
Folate receptor beta
Ligand
BDBM50027656
Substrate
Meas. Tech.
ChEMBL_1431347 (CHEMBL3387473)
IC50
60±n/a nM
Citation
 Golani, LKGeorge, CZhao, SRaghavan, SOrr, SWallace, AWilson, MRHou, ZMatherly, LHGangjee, A Structure-activity profiles of novel 6-substituted pyrrolo[2,3-d]pyrimidine thienoyl antifolates with modified amino acids for cellular uptake by folate receptorsa andß and the proton-coupled folate transporter. J Med Chem 57:8152-66 (2014)  
Target
Name:
Folate receptor beta
Synonyms:
FBP FOLR2_HUMAN Folate receptor 2 Folate receptor, fetal/placental | Placental folate-binding protein
Type:
PROTEIN
Mol. Mass.:
29286.32
Organism:
Homo sapiens (Human)
Description:
ChEMBL_20077
Residue:
255
  
Inhibitor
Name:
BDBM50027656
Synonyms:
CHEBI:63616 LY-231514 US9422297, Pemetrexed
Type:
Small organic molecule
Emp. Form.:
C20H21N5O6
Mol. Mass.:
427.4106
SMILES:
Nc1nc2[nH]cc(CCc3ccc(cc3)C(=O)N[C@@H](CCC(O)=O)C(O)=O)c2c(=O)[nH]1
: