Target
Apelin receptor
Ligand
BDBM50027836
Substrate
Meas. Tech.
ChEMBL_1436814 (CHEMBL3386599)
EC50
>30000±n/a nM
Citation
 McKeown, SCZecri, FJFortier, ETaggart, ASviridenko, LAdams, CMMcAllister, KHPin, SS The design and implementation of a generic lipopeptide scanning platform to enable the identification of 'locally acting' agonists for the apelin receptor. Bioorg Med Chem Lett 24:4871-5 (2014)  
Target
Name:
Apelin receptor
Synonyms:
AGTRL1 APJ_HUMAN Angiotensin receptor-like 1 Apelin receptor (APJ) G-protein coupled receptor HG11
Type:
Enzyme Catalytic Domain
Mol. Mass.:
42664.06
Organism:
Homo sapiens (Human)
Description:
P35414
Residue:
380
  
Inhibitor
Name:
BDBM50027836
Synonyms:
CHEMBL3338688
Type:
Small organic molecule
Emp. Form.:
C87H135N17O17
Mol. Mass.:
1691.1065
SMILES:
CCCCCCCCCCCCCCCC(=O)N[C@@H](C(C)C)C(=O)N[C@@H]([C@@H](C)O)C(=O)N[C@@H](CC(C)C)C(=O)N1CCC[C@H]1C(=O)N[C@@H](CC(C)C)C(=O)N[C@@H](Cc1c[nH]c2ccccc12)C(=O)N[C@@H](C)C(=O)N[C@@H]([C@@H](C)O)C(=O)N[C@@H](Cc1ccc(O)cc1)C(=O)N[C@@H](C)C(=O)N[C@@H](Cc1ccc(O)cc1)C(=O)N[C@@H](CCCNC(N)=N)C(N)=O
: