Target
Bromodomain-containing protein 3
Ligand
BDBM50028138
Substrate
Meas. Tech.
ChEMBL_1434713 (CHEMBL3382828)
IC50
501±n/a nM
Citation
 Gosmini, RNguyen, VLToum, JSimon, CBrusq, JMKrysa, GMirguet, ORiou-Eymard, AMBoursier, EVTrottet, LBamborough, PClark, HChung, CWCutler, LDemont, EHKaur, RLewis, AJSchilling, MBSoden, PETaylor, SWalker, ALWalker, MDPrinjha, RKNicodème, E The discovery of I-BET726 (GSK1324726A), a potent tetrahydroquinoline ApoA1 up-regulator and selective BET bromodomain inhibitor. J Med Chem 57:8111-31 (2014)  
Target
Name:
Bromodomain-containing protein 3
Synonyms:
BRD3 Bromodomain and extra-terminal motif (BET) Bromodomain-containing protein 3 (BRD3) RING3-like protein | RING3L
Type:
Protein
Mol. Mass.:
79571.81
Organism:
Homo sapiens (Human)
Description:
Q15059
Residue:
726
  
Inhibitor
Name:
BDBM50028138
Synonyms:
CHEMBL3353996
Type:
Small organic molecule
Emp. Form.:
C30H34N2O3
Mol. Mass.:
470.6026
SMILES:
COC(=O)c1ccc(cc1)-c1ccc2N([C@@H](C)C[C@@H](Nc3ccc(cc3)C(C)(C)C)c2c1)C(C)=O
: