Target
Bromodomain-containing protein 4
Ligand
BDBM50028141
Substrate
Meas. Tech.
ChEMBL_1434714 (CHEMBL3382829)
IC50
631±n/a nM
Citation
 Gosmini, RNguyen, VLToum, JSimon, CBrusq, JMKrysa, GMirguet, ORiou-Eymard, AMBoursier, EVTrottet, LBamborough, PClark, HChung, CWCutler, LDemont, EHKaur, RLewis, AJSchilling, MBSoden, PETaylor, SWalker, ALWalker, MDPrinjha, RKNicodème, E The discovery of I-BET726 (GSK1324726A), a potent tetrahydroquinoline ApoA1 up-regulator and selective BET bromodomain inhibitor. J Med Chem 57:8111-31 (2014)  
Target
Name:
Bromodomain-containing protein 4
Synonyms:
BRD4 Bromodomain-containing protein 4 (BRD4) Protein HUNK1
Type:
Protein
Mol. Mass.:
152264.84
Organism:
Homo sapiens (Human)
Description:
O60885
Residue:
1362
  
Inhibitor
Name:
BDBM50028141
Synonyms:
CHEMBL3353999
Type:
Small organic molecule
Emp. Form.:
C26H26N2O3
Mol. Mass.:
414.4962
SMILES:
C[C@H]1C[C@@H](Nc2ccc(C)cc2)c2cc(ccc2N1C(C)=O)-c1ccc(cc1)C(O)=O
: