Target
Adenosine kinase
Ligand
BDBM50350207
Substrate
Meas. Tech.
ChEMBL_1439143 (CHEMBL3385544)
IC50
200±n/a nM
Citation
 Sná?el, JNau?, PDostál, JHnízda, AFanfrlík, JBrynda, JBourderioux, ADu?ek, MDvoráková, HStolaríková, JZábranská, HPohl, RKonecný, PD?ubák, PVotruba, IHajdúch, MRezácová, PVeverka, VHocek, MPichová, I Structural basis for inhibition of mycobacterial and human adenosine kinase by 7-substituted 7-(Het)aryl-7-deazaadenine ribonucleosides. J Med Chem 57:8268-79 (2014)  
Target
Name:
Adenosine kinase
Synonyms:
ADK | ADK_HUMAN
Type:
PROTEIN
Mol. Mass.:
40545.97
Organism:
Homo sapiens (Human)
Description:
ChEMBL_1467841
Residue:
362
  
Inhibitor
Name:
BDBM50350207
Synonyms:
CHEMBL1814776
Type:
Small organic molecule
Emp. Form.:
C13H14N4O4
Mol. Mass.:
290.2747
SMILES:
Nc1ncnc2n(cc(C#C)c12)[C@@H]1O[C@H](CO)[C@@H](O)[C@H]1O
: