Target
Collagenase 3
Ligand
BDBM16596
Substrate
Meas. Tech.
ChEMBL_1433222 (CHEMBL3388189)
IC50
8.0±n/a nM
Citation
 Fabre, BRamos, Ade Pascual-Teresa, B Targeting matrix metalloproteinases: exploring the dynamics of the s1' pocket in the design of selective, small molecule inhibitors. J Med Chem 57:10205-19 (2014)  
Target
Name:
Collagenase 3
Synonyms:
MMP-13 MMP13_HUMAN Matrix metalloproteinase-13 (MMP-13) | Matrix metalloproteinase-13 (MMP13)
Type:
Enzyme
Mol. Mass.:
53808.06
Organism:
Homo sapiens (Human)
Description:
P45452
Residue:
471
  
Inhibitor
Name:
BDBM16596
Synonyms:
4-N,6-N-bis[(4-fluoro-3-methylphenyl)methyl]pyrimidine-4,6-dicarboxamide MMP Inhibitor, 4 Pyrimidine Dicarboxamide Inhibitor, 4
Type:
Small organic molecule
Emp. Form.:
C22H20F2N4O2
Mol. Mass.:
410.4166
SMILES:
Cc1cc(CNC(=O)c2cc(ncn2)C(=O)NCc2ccc(F)c(C)c2)ccc1F
: