Target
Receptor tyrosine-protein kinase erbB-2
Ligand
BDBM50030383
Substrate
Meas. Tech.
ChEMBL_1432457 (CHEMBL3385739)
IC50
0.500000±n/a nM
Citation
 Lyu, AFang, LGou, S Design and synthesis of Lapatinib derivatives containing a branched side chain as HER1/HER2 targeting antitumor drug candidates. Eur J Med Chem 87:631-42 (2014)  
Target
Name:
Receptor tyrosine-protein kinase erbB-2
Synonyms:
2.7.10.1 CD_antigen=CD340 ERBB2_HUMAN FASN/HER2 HER2 MLN19 NEU Proto-oncogene Neu Tyrosine kinase-type cell surface receptor HER2 | p185erbB2
Type:
Mol. Mass.:
137894.47
Organism:
Homo sapiens (Human)
Description:
P04626
Residue:
1255
  
Inhibitor
Name:
BDBM50030383
Synonyms:
CHEMBL3344216
Type:
Small organic molecule
Emp. Form.:
C30H28ClFN4O4S
Mol. Mass.:
595.084
SMILES:
CN(C)[C@H](CS(C)(=O)=O)c1ccc(o1)-c1ccc2ncnc(Nc3ccc(OCc4cccc(F)c4)c(Cl)c3)c2c1
: