Target
Procathepsin L
Ligand
BDBM19855
Substrate
Meas. Tech.
ChEMBL_1437727 (CHEMBL3382374)
Ki
3260±n/a nM
Citation
 Schmitz, JBeckmann, AMDudic, ALi, TSellier, RBartz, UGütschow, M 3-Cyano-3-aza-ß-amino Acid Derivatives as Inhibitors of Human Cysteine Cathepsins. ACS Med Chem Lett 5:1076-81 (2014)  
Target
Name:
Procathepsin L
Synonyms:
CATL1_HUMAN CTSL CTSL1 Cathepsin L Cathepsin L1 heavy chain MEP cathepsin L preproprotein
Type:
Enzyme
Mol. Mass.:
37557.19
Organism:
Homo sapiens (Human)
Description:
Purchased from Calbiochem (San Diego, CA).
Residue:
333
  
Inhibitor
Name:
BDBM19855
Synonyms:
Balicatib N-[1-(cyanomethylcarbamoyl)cyclohexyl]-4-(4-propylpiperazin-1-yl) basic piperazine-containing compound, 10
Type:
Small organic molecule
Emp. Form.:
C23H33N5O2
Mol. Mass.:
411.5404
SMILES:
CCCN1CCN(CC1)c1ccc(cc1)C(=O)NC1(CCCCC1)C(=O)NCC#N
: