Target
Apoptosis regulator Bcl-2
Ligand
BDBM50030757
Substrate
Meas. Tech.
ChEMBL_1437736 (CHEMBL3382383)
Ki
140±n/a nM
Target
Name:
Apoptosis regulator Bcl-2
Synonyms:
Apoptosis regulator Bcl-2 Protein BCL-2 BCL2_HUMAN | Bcl-2 Protein
Type:
Homodimer or heterodimer
Mol. Mass.:
26269.11
Organism:
Homo sapiens (Human)
Description:
P10415
Residue:
239
  
Inhibitor
Name:
BDBM50030757
Synonyms:
CHEMBL3342196
Type:
Small organic molecule
Emp. Form.:
C43H45N11O4S2
Mol. Mass.:
844.019
SMILES:
CN1CCN(CCCNc2ncnc3n(ncc23)-c2ccc(OCCCc3sc(nc3C(O)=O)N3CCc4cccc(C(=O)Nc5nc6ccccc6s5)c4C3)cc2)CC1
: