Target
Apoptosis regulator Bcl-2
Ligand
BDBM50030751
Substrate
Meas. Tech.
ChEMBL_1437736 (CHEMBL3382383)
Ki
90±n/a nM
Target
Name:
Apoptosis regulator Bcl-2
Synonyms:
Apoptosis regulator Bcl-2 Protein BCL-2 BCL2_HUMAN | Bcl-2 Protein
Type:
Homodimer or heterodimer
Mol. Mass.:
26269.11
Organism:
Homo sapiens (Human)
Description:
P10415
Residue:
239
  
Inhibitor
Name:
BDBM50030751
Synonyms:
CHEMBL3342334
Type:
Small organic molecule
Emp. Form.:
C35H31F2N5O4S2
Mol. Mass.:
687.779
SMILES:
CN(C)CC#Cc1cc(F)c(OCCCc2sc(nc2C(O)=O)N2CCc3cccc(C(=O)Nc4nc5ccccc5s4)c3C2)cc1F
: