Target
3-oxoacyl-[acyl-carrier-protein] synthase 3
Ligand
BDBM50031282
Substrate
Meas. Tech.
ChEMBL_1432525 (CHEMBL3386957)
IC50
6800±n/a nM
Citation
 Qin, YJWang, PFMakawana, JAWang, ZCWang, ZNYan-Gu, naJiang, AQZhu, HL Design, synthesis and biological evaluation of metronidazole-thiazole derivatives as antibacterial inhibitors. Bioorg Med Chem Lett 24:5279-83 (2014)  
Target
Name:
3-oxoacyl-[acyl-carrier-protein] synthase 3
Synonyms:
3-oxoacyl-[acyl-carrier-protein] synthase 3-oxoacyl-[acyl-carrier-protein] synthase III | Beta-ketoacyl-ACP synthase III (FabH)
Type:
Enzyme
Mol. Mass.:
33506.68
Organism:
Escherichia coli
Description:
C3TDZ2
Residue:
317
  
Inhibitor
Name:
BDBM50031282
Synonyms:
CHEBI:17630 | Kanamycin
Type:
Small organic molecule
Emp. Form.:
C18H36N4O11
Mol. Mass.:
484.4986
SMILES:
NC[C@H]1O[C@H](O[C@@H]2[C@@H](N)C[C@@H](N)[C@H](O[C@H]3O[C@H](CO)[C@@H](O)[C@H](N)[C@H]3O)[C@H]2O)[C@H](O)[C@@H](O)[C@@H]1O
: