Target
Carbonic anhydrase 1
Ligand
BDBM50031588
Substrate
Meas. Tech.
ChEMBL_1440922 (CHEMBL3375186)
Kd
710±n/a nM
Target
Name:
Carbonic anhydrase 1
Synonyms:
CA-I CAB Carbonate dehydratase I Carbonic anhydrase 1 (CA I) Carbonic anhydrase 1 (Recombinant CA I) Carbonic anhydrase B Carbonic anhydrase I (CA I) Carbonic anhydrase I (CAI) Carbonic anhydrase isoenzyme I (hCA I) | hCA
Type:
Enzyme
Mol. Mass.:
28873.37
Organism:
Homo sapiens (Human)
Description:
P00915
Residue:
261
  
Inhibitor
Name:
BDBM50031588
Synonyms:
CHEMBL3359181
Type:
Small organic molecule
Emp. Form.:
C16H23F3N2O5S2
Mol. Mass.:
444.489
SMILES:
NS(=O)(=O)c1c(F)c(F)c(c(NC2CCCCCCC2)c1F)S(=O)(=O)CCO
: