Target
Heat shock protein HSP 90-alpha
Ligand
BDBM50031728
Substrate
Meas. Tech.
ChEMBL_1432555 (CHEMBL3387537)
IC50
10.0±n/a nM
Citation
 McBride, CMLevine, BXia, YBellamacina, CMachajewski, TGao, ZRenhowe, PAntonios-McCrea, WBarsanti, PBrinner, KCostales, ADoughan, BLin, XLouie, AMcKenna, MMendenhall, KPoon, DRico, AWang, MWilliams, TEAbrams, TFong, SHendrickson, TLei, DLin, JMenezes, DPryer, NTaverna, PXu, YZhou, YShafer, CM Design, structure-activity relationship, and in vivo characterization of the development candidate NVP-HSP990. J Med Chem 57:9124-9 (2014)  
Target
Name:
Heat shock protein HSP 90-alpha
Synonyms:
HS90A_HUMAN HSP86 HSP90AA1 HSPCA Heat shock 86 kDa Heat shock protein HSP 90-alpha (HSP90) LAP-2 Lipopolysaccharide-associated protein 2 heat shock protein 90kDa alpha (cytosolic), class A member 1 isoform 2
Type:
Molecular Chaperone
Mol. Mass.:
84623.45
Organism:
Homo sapiens (Human)
Description:
P07900
Residue:
732
  
Inhibitor
Name:
BDBM50031728
Synonyms:
CHEMBL3360312
Type:
Small organic molecule
Emp. Form.:
C19H17FN6O2
Mol. Mass.:
380.3757
SMILES:
COc1cncc(n1)-c1cc(F)ccc1[C@H]1Cc2nc(N)nc(C)c2C(=O)N1
: