Target
Estrogen receptor
Ligand
BDBM20607
Substrate
Meas. Tech.
ChEMBL_1433493 (CHEMBL3382763)
IC50
61±n/a nM
Citation
 O'Boyle, NMPollock, JKCarr, MKnox, AJNathwani, SMWang, SCaboni, LZisterer, DMMeegan, MJ ß-Lactam estrogen receptor antagonists and a dual-targeting estrogen receptor/tubulin ligand. J Med Chem 57:9370-82 (2014)  
Target
Name:
Estrogen receptor
Synonyms:
ER ESR ESR1_HUMAN Estrogen receptor Estrogen receptor (ER-alpha) Estrogen receptor alpha (ER) Nuclear receptor subfamily 3 group A member 1
Type:
Protein
Mol. Mass.:
66230.44
Organism:
Homo sapiens (Human)
Description:
P03372
Residue:
595
  
Inhibitor
Name:
BDBM20607
Synonyms:
(2-{4-[(1Z)-1,2-diphenylbut-1-en-1-yl]phenoxy}ethyl)dimethylamine CHEMBL83 NCGC00024928 Tamoxifen Tamoxifen, 7 med.21724, Compound Tamoxifen
Type:
Small organic molecule
Emp. Form.:
C26H29NO
Mol. Mass.:
371.5146
SMILES:
CC\C(=C(/c1ccccc1)c1ccc(OCCN(C)C)cc1)c1ccccc1
: