Target
ATP-dependent translocase ABCB1
Ligand
BDBM50032249
Substrate
Meas. Tech.
ChEMBL_1439392 (CHEMBL3389757)
EC50
4.0±n/a nM
Citation
 Capparelli, EZinzi, LCantore, MContino, MPerrone, MGLuurtsema, GBerardi, FPerrone, RColabufo, NA SAR studies on tetrahydroisoquinoline derivatives: the role of flexibility and bioisosterism to raise potency and selectivity toward P-glycoprotein. J Med Chem 57:9983-94 (2014)  
Target
Name:
ATP-dependent translocase ABCB1
Synonyms:
ABCB1 MDR1_HUMAN Multidrug resistance protein 1 P-glycoprotein (P-gp) PGY1
Type:
Protein
Mol. Mass.:
141503.50
Organism:
Homo sapiens (Human)
Description:
P08183
Residue:
1280
  
Inhibitor
Name:
BDBM50032249
Synonyms:
CHEMBL3352986
Type:
Small organic molecule
Emp. Form.:
C28H33NO4
Mol. Mass.:
447.5659
SMILES:
COc1ccc(cc1)-c1ccc(OCCCCN2CCc3cc(OC)c(OC)cc3C2)cc1
: