Target
Coagulation factor VII
Ligand
BDBM50032874
Substrate
Meas. Tech.
ChEMBL_1431780 (CHEMBL3385076)
Ki
10000±n/a nM
Citation
 Hangeland, JJFriends, TJRossi, KASmallheer, JMWang, CSun, ZCorte, JRFang, TWong, PCRendina, ARBarbera, FABozarth, JMLuettgen, JMWatson, CAZhang, GWei, ARamamurthy, VMorin, PEBisacchi, GSSubramaniam, SArunachalam, PMathur, ASeiffert, DAWexler, RRQuan, ML Phenylimidazoles as potent and selective inhibitors of coagulation factor XIa with in vivo antithrombotic activity. J Med Chem 57:9915-32 (2014)  
Target
Name:
Coagulation factor VII
Synonyms:
Coagulation factor VII FA7_RABIT Factor VII light chain | Serum prothrombin conversion accelerator
Type:
PROTEIN
Mol. Mass.:
49010.96
Organism:
Oryctolagus cuniculus
Description:
ChEMBL_109511
Residue:
444
  
Inhibitor
Name:
BDBM50032874
Synonyms:
CHEMBL3355683
Type:
Small organic molecule
Emp. Form.:
C28H31ClF3N7O3
Mol. Mass.:
606.039
SMILES:
OC(=O)C(F)(F)F.NC[C@H]1CC[C@@H](CC1)C(=O)N[C@@H](Cc1ccccc1)c1nc(c(Cl)[nH]1)-c1ccc2c(N)n[nH]c2c1
: