Target
Toll-like receptor 8
Ligand
BDBM50033102
Substrate
Meas. Tech.
ChEMBL_1433564 (CHEMBL3383966)
IC50
>10000±n/a nM
Citation
 Watanabe, MKasai, MTomizawa, HAoki, MEiho, KIsobe, YAsano, S Dihydropyrrolo[2,3-d]pyrimidines: Selective Toll-Like Receptor 9 Antagonists from Scaffold Morphing Efforts. ACS Med Chem Lett 5:1235-9 (2014)  
Target
Name:
Toll-like receptor 8
Synonyms:
CD_antigen: CD288 TLR8_HUMAN | TRL8
Type:
Enzyme
Mol. Mass.:
119828.77
Organism:
Homo sapiens (Human)
Description:
Q9NR97
Residue:
1041
  
Inhibitor
Name:
BDBM50033102
Synonyms:
CHEMBL3357070
Type:
Small organic molecule
Emp. Form.:
C25H36N6O2
Mol. Mass.:
452.5923
SMILES:
OCCN1CCN(CC1)c1ccc(cc1)-c1ncc2CCN(CCCN3CCOCC3)c2n1
: