Target
Toll-like receptor 9
Ligand
BDBM50033124
Substrate
Meas. Tech.
ChEMBL_1433562 (CHEMBL3383964)
IC50
11±n/a nM
Citation
 Watanabe, MKasai, MTomizawa, HAoki, MEiho, KIsobe, YAsano, S Dihydropyrrolo[2,3-d]pyrimidines: Selective Toll-Like Receptor 9 Antagonists from Scaffold Morphing Efforts. ACS Med Chem Lett 5:1235-9 (2014)  
Target
Name:
Toll-like receptor 9
Synonyms:
CD_antigen: CD289 TLR9_HUMAN
Type:
Enzyme
Mol. Mass.:
115889.91
Organism:
Homo sapiens (Human)
Description:
Q9NR96
Residue:
1032
  
Inhibitor
Name:
BDBM50033124
Synonyms:
CHEMBL3356617
Type:
Small organic molecule
Emp. Form.:
C24H34N6
Mol. Mass.:
406.567
SMILES:
CN1CCN(CC1)c1ccc(cc1)-c1nc2N(CCN3CCCC3)CCc2c(C)n1
: