Target
Matrix metalloproteinase-14
Ligand
BDBM50033819
Substrate
Meas. Tech.
ChEMBL_1435764 (CHEMBL3388956)
IC50
3500±n/a nM
Citation
 Durham, TBKlimkowski, VJRito, CJMarimuthu, JToth, JLLiu, CDurbin, JDStout, SLAdams, LSwearingen, CLin, CChambers, MGThirunavukkarasu, KWiley, MR Identification of potent and selective hydantoin inhibitors of aggrecanase-1 and aggrecanase-2 that are efficacious in both chemical and surgical models of osteoarthritis. J Med Chem 57:10476-85 (2014)  
Target
Name:
Matrix metalloproteinase-14
Synonyms:
MMP-14 MMP14 MT-MMP 1 MT1MMP Matrix Metalloproteinase-14 (MMP-14) Matrix metalloproteinase-14 Membrane-type matrix metalloproteinase 1 | Membrane-type-1 matrix metalloproteinase
Type:
Protein
Mol. Mass.:
65900.19
Organism:
Homo sapiens (Human)
Description:
P50281
Residue:
582
  
Inhibitor
Name:
BDBM50033819
Synonyms:
CHEMBL3358153
Type:
Small organic molecule
Emp. Form.:
C19H14ClN3O4
Mol. Mass.:
383.785
SMILES:
Clc1ccc2oc(cc2c1)C(=O)NC[C@]1(NC(=O)NC1=O)c1ccccc1
: