Target
A disintegrin and metalloproteinase with thrombospondin motifs 4
Ligand
BDBM50033819
Substrate
Meas. Tech.
ChEMBL_1435758 (CHEMBL3388950)
IC50
12±n/a nM
Citation
 Durham, TBKlimkowski, VJRito, CJMarimuthu, JToth, JLLiu, CDurbin, JDStout, SLAdams, LSwearingen, CLin, CChambers, MGThirunavukkarasu, KWiley, MR Identification of potent and selective hydantoin inhibitors of aggrecanase-1 and aggrecanase-2 that are efficacious in both chemical and surgical models of osteoarthritis. J Med Chem 57:10476-85 (2014)  
Target
Name:
A disintegrin and metalloproteinase with thrombospondin motifs 4
Synonyms:
A disintegrin and metalloproteinase with thrombospondin motifs 4 (ADAMTS-4) ATS4_HUMAN KIAA0688 | Metalloproteinase with thrombospondin motifs 4 (ADAMTS-4)
Type:
Enzyme
Mol. Mass.:
90214.54
Organism:
Homo sapiens (Human)
Description:
O75173
Residue:
837
  
Inhibitor
Name:
BDBM50033819
Synonyms:
CHEMBL3358153
Type:
Small organic molecule
Emp. Form.:
C19H14ClN3O4
Mol. Mass.:
383.785
SMILES:
Clc1ccc2oc(cc2c1)C(=O)NC[C@]1(NC(=O)NC1=O)c1ccccc1
: