Target
Cytochrome P450 2C19
Ligand
BDBM50034557
Substrate
Meas. Tech.
ChEMBL_1439476 (CHEMBL3381253)
IC50
>50000±n/a nM
Citation
 Skidmore, JHeer, JJohnson, CNNorton, DRedshaw, SSweeting, JHurst, DCridland, AVesey, DWall, IAhmed, MRivers, DMyatt, JGiblin, GPhilpott, KKumar, UStevens, ABit, RAHaynes, ATaylor, SWatson, RWitherington, JDemont, EHeightman, TD Optimization of sphingosine-1-phosphate-1 receptor agonists: effects of acidic, basic, and zwitterionic chemotypes on pharmacokinetic and pharmacodynamic profiles. J Med Chem 57:10424-42 (2014)  
Target
Name:
Cytochrome P450 2C19
Synonyms:
CP2CJ_HUMAN CYPIIC17 Cytochrome P450 2C19 (CYP2C19) Mephenytoin 4-hydroxylase P450-254C
Type:
Enzyme
Mol. Mass.:
55935.47
Organism:
Homo sapiens (Human)
Description:
P33261
Residue:
490
  
Inhibitor
Name:
BDBM50034557
Synonyms:
CHEMBL3360360
Type:
Small organic molecule
Emp. Form.:
C21H18ClN4NaO4
Mol. Mass.:
448.835
SMILES:
[Na+].CC(C)Oc1ccc(cc1Cl)-c1nc(no1)-c1cccc2n(CCC([O-])=O)ncc12
: