Target
Cytochrome P450 2C9
Ligand
BDBM50034554
Substrate
Meas. Tech.
ChEMBL_1439475 (CHEMBL3381252)
IC50
>50000±n/a nM
Citation
 Skidmore, JHeer, JJohnson, CNNorton, DRedshaw, SSweeting, JHurst, DCridland, AVesey, DWall, IAhmed, MRivers, DMyatt, JGiblin, GPhilpott, KKumar, UStevens, ABit, RAHaynes, ATaylor, SWatson, RWitherington, JDemont, EHeightman, TD Optimization of sphingosine-1-phosphate-1 receptor agonists: effects of acidic, basic, and zwitterionic chemotypes on pharmacokinetic and pharmacodynamic profiles. J Med Chem 57:10424-42 (2014)  
Target
Name:
Cytochrome P450 2C9
Synonyms:
(R)-limonene 6-monooxygenase CP2C9_HUMAN CYP2C9 Cytochrome P450 2C9 (CYP2C9 ) P-450MP P450 PB-1 | S-mephenytoin 4-hydroxylase
Type:
Enzyme
Mol. Mass.:
55636.33
Organism:
Homo sapiens (Human)
Description:
P11712
Residue:
490
  
Inhibitor
Name:
BDBM50034554
Synonyms:
CHEMBL3359854
Type:
Small organic molecule
Emp. Form.:
C23H25ClN4O5
Mol. Mass.:
472.921
SMILES:
CC(C)Oc1ncc(cc1Cl)-c1nc(no1)-c1cccc2C(CCCC(O)=O)NCCOc12
: