Target
Sphingosine 1-phosphate receptor 3
Ligand
BDBM50034560
Substrate
Meas. Tech.
ChEMBL_1439470 (CHEMBL3381247)
EC50
251±n/a nM
Citation
 Skidmore, JHeer, JJohnson, CNNorton, DRedshaw, SSweeting, JHurst, DCridland, AVesey, DWall, IAhmed, MRivers, DMyatt, JGiblin, GPhilpott, KKumar, UStevens, ABit, RAHaynes, ATaylor, SWatson, RWitherington, JDemont, EHeightman, TD Optimization of sphingosine-1-phosphate-1 receptor agonists: effects of acidic, basic, and zwitterionic chemotypes on pharmacokinetic and pharmacodynamic profiles. J Med Chem 57:10424-42 (2014)  
Target
Name:
Sphingosine 1-phosphate receptor 3
Synonyms:
C9orf108 EDG3 S1P receptor 3 S1P3 S1PR3_HUMAN Sphingosine 1-phosphate receptor 3 (S1P3) | Sphingosine 1-phosphate receptor Edg-3
Type:
G Protein-Coupled Receptor (GPCR)
Mol. Mass.:
42278.13
Organism:
Homo sapiens (Human)
Description:
Q99500
Residue:
378
  
Inhibitor
Name:
BDBM50034560
Synonyms:
CHEMBL3359851
Type:
Small organic molecule
Emp. Form.:
C23H24ClN3O5
Mol. Mass.:
457.907
SMILES:
CC(C)Oc1ccc(cc1Cl)-c1nc(no1)-c1ccc2OCC(CCC(O)=O)NCc2c1
: