Target
Beta-secretase 1
Ligand
BDBM50036590
Substrate
Meas. Tech.
ChEMBL_1433718 (CHEMBL3386389)
Ki
66000±n/a nM
Citation
 Caldwell, JPMazzola, RDDurkin, JChen, JChen, XFavreau, LKennedy, MKuvelkar, RLee, JMcHugh, NMcKittrick, BOrth, PStamford, AStrickland, CVoigt, JWang, LZhang, LZhang, QZhu, Z Discovery of potent iminoheterocycle BACE1 inhibitors. Bioorg Med Chem Lett 24:5455-9 (2015)  
Target
Name:
Beta-secretase 1
Synonyms:
ASP2 Aspartyl protease 2 BACE1 Beta-secretase (BACE) Beta-secretase 1 (BACE 1) Beta-secretase 1 (BACE1) Beta-site amyloid precursor protein cleaving enzyme 1 Memapsin-2 beta-Secretase (BACE-1) | beta-Secretase (BACE1)
Type:
Protein
Mol. Mass.:
55755.10
Organism:
Homo sapiens (Human)
Description:
P56817
Residue:
501
  
Inhibitor
Name:
BDBM50036590
Synonyms:
CHEMBL3353632
Type:
Small organic molecule
Emp. Form.:
C18H32N4O
Mol. Mass.:
320.4729
SMILES:
[H][C@@]1(C[C@@]2(CCC3CCCCC3)NC(=N)N(C)C2=O)CCCNC1
: