Target
Genome polyprotein
Ligand
BDBM50037466
Substrate
Meas. Tech.
ChEMBL_1437305 (CHEMBL3384808)
Ki
420±n/a nM
Citation
 Lampa, AAlogheli, HEhrenberg, AEÅkerblom, ESvensson, RArtursson, PDanielson, UHKarlén, ASandström, A Vinylated linear P2 pyrimidinyloxyphenylglycine based inhibitors of the HCV NS3/4A protease and corresponding macrocycles. Bioorg Med Chem 22:6595-615 (2015)  
Target
Name:
Genome polyprotein
Synonyms:
Nonstructural protein NS3-4A
Type:
PROTEIN
Mol. Mass.:
71633.49
Organism:
Hepatitis C virus
Description:
ChEMBL_109716
Residue:
674
  
Inhibitor
Name:
BDBM50037466
Synonyms:
CHEMBL3356709
Type:
Small organic molecule
Emp. Form.:
C42H54N6O9S
Mol. Mass.:
818.978
SMILES:
CCC[C@H](NC(=O)C(NC(=O)[C@@H](NC(=O)OCCC=C)C(C)(C)C)c1ccc(Oc2cc(OC)nc(n2)-c2ccccc2)c(C=C)c1)C(=O)NS(=O)(=O)CCCC=C
: