Target
Cytochrome P450 2A6
Ligand
BDBM50037776
Substrate
Meas. Tech.
ChEMBL_1438834 (CHEMBL3390302)
Ki
60±n/a nM
Citation
 Tani, NJuvonen, RORaunio, HFashe, MLeppänen, JZhao, BTyndale, RFRahnasto-Rilla, M Rational design of novel CYP2A6 inhibitors. Bioorg Med Chem 22:6655-64 (2015)  
Target
Name:
Cytochrome P450 2A6
Synonyms:
1,4-cineole 2-exo-monooxygenase CP2A6_HUMAN CYP2A6 Coumarin 7-hydroxylase Cytochrome P450 IIA3 | Cytochrome P450(I)
Type:
Protein
Mol. Mass.:
56514.34
Organism:
Homo sapiens (Human)
Description:
P11509
Residue:
494
  
Inhibitor
Name:
BDBM50037776
Synonyms:
CHEMBL3358193
Type:
Small organic molecule
Emp. Form.:
C8H5NOS
Mol. Mass.:
163.196
SMILES:
O=Cc1cc2ccncc2s1
: