Target
Adenosine receptor A1
Ligand
BDBM50038026
Substrate
Meas. Tech.
ChEMBL_1439617 (CHEMBL3383135)
Ki
4.7±n/a nM
Citation
 Giovannoni, MPCiciani, GCilibrizzi, ACrocetti, LDaniele, SDi Cesare Mannelli, LGhelardini, CGiacomelli, CGuerrini, GMartini, CTrincavelli, MLVergelli, C Further studies on pyrazolo[1',5':1,6]pyrimido[4,5-d]pyridazin-4(3H)-ones as potent and selective human A1 adenosine receptor antagonists. Eur J Med Chem 89:32-41 (2014)  
Target
Name:
Adenosine receptor A1
Synonyms:
A1 adenosine receptor (hA1) AA1R_HUMAN ADORA1 Adenosine A1-receptor Adenosine receptor A1 (hA1) | Adenosine transporter (AdT)
Type:
G Protein-Coupled Receptor (GPCR)
Mol. Mass.:
36520.92
Organism:
Homo sapiens (Human)
Description:
P30542
Residue:
326
  
Inhibitor
Name:
BDBM50038026
Synonyms:
CHEMBL3359420
Type:
Small organic molecule
Emp. Form.:
C28H27N5S
Mol. Mass.:
465.612
SMILES:
CCc1nc2c(c(nn(Cc3ccccc3)c2=S)C2CCCC2)c2cc(nn12)-c1ccccc1
: