Target
Serine/threonine-protein kinase B-raf
Ligand
BDBM50038607
Substrate
Meas. Tech.
ChEMBL_1444340 (CHEMBL3371771)
IC50
6430±n/a nM
Citation
 Yang, WChen, YZhou, XGu, YQian, WZhang, FHan, WLu, TTang, W Design, synthesis and biological evaluation of bis-aryl ureas and amides based on 2-amino-3-purinylpyridine scaffold as DFG-out B-Raf kinase inhibitors. Eur J Med Chem 89:581-96 (2014)  
Target
Name:
Serine/threonine-protein kinase B-raf
Synonyms:
B-RAF B-Raf proto-oncogene serine/threonine-protein kinase BRAF1 RAFB1 v-Raf murine sarcoma viral oncogene homolog B1
Type:
Serine/threonine-protein kinase
Mol. Mass.:
84446.00
Organism:
Homo sapiens (Human)
Description:
P15056
Residue:
766
  
Inhibitor
Name:
BDBM50038607
Synonyms:
CHEMBL3354843
Type:
Small organic molecule
Emp. Form.:
C18H14ClN7O
Mol. Mass.:
379.803
SMILES:
CC(=O)Nc1cc(Nc2ncccc2-c2ncnc3[nH]cnc23)ccc1Cl
: