Target
Cytochrome P450 11B2, mitochondrial
Ligand
BDBM8611
Substrate
Meas. Tech.
ChEMBL_1444348 (CHEMBL3371779)
IC50
0.800000±n/a nM
Citation
 Grombein, CMHu, QHeim, RRau, SZimmer, CHartmann, RW 1-Phenylsulfinyl-3-(pyridin-3-yl)naphthalen-2-ols: a new class of potent and selective aldosterone synthase inhibitors. Eur J Med Chem 89:597-605 (2014)  
Target
Name:
Cytochrome P450 11B2, mitochondrial
Synonyms:
Aldosterone Synthase (CYP11B2) Aldosterone-synthesizing enzyme CYP11B2 Cytochrome P450 11B2 Cytochrome P450 11B2, mitochondrial P-450C18 | Steroid 18-hydroxylase
Type:
Protein
Mol. Mass.:
57582.15
Organism:
Homo sapiens (Human)
Description:
P19099
Residue:
503
  
Inhibitor
Name:
BDBM8611
Synonyms:
4-{5H,6H,7H,8H-imidazo[1,5-a]pyridin-5-yl}benzonitrile CHEMBL9298 US9271963, Fadrozole
Type:
Small organic molecule
Emp. Form.:
C14H13N3
Mol. Mass.:
223.2731
SMILES:
N#Cc1ccc(cc1)C1CCCc2cncn12
: