Target
Carbonic anhydrase 4
Ligand
BDBM50040427
Substrate
Meas. Tech.
ChEMBL_1443934 (CHEMBL3374774)
Ki
233±n/a nM
Citation
 Ceruso, MAntel, SVullo, DScozzafava, ASupuran, CT Inhibition studies of new ureido-substituted sulfonamides incorporating a GABA moiety against human carbonic anhydrase isoforms I-XIV. Bioorg Med Chem 22:6768-75 (2015)  
Target
Name:
Carbonic anhydrase 4
Synonyms:
CA-IV CAH4_HUMAN Carbonic anhydrase Carbonic anhydrase IV (CA IV)
Type:
Enzyme
Mol. Mass.:
35037.98
Organism:
Homo sapiens (Human)
Description:
P22748
Residue:
312
  
Inhibitor
Name:
BDBM50040427
Synonyms:
CHEMBL3360586
Type:
Small organic molecule
Emp. Form.:
C18H22N4O4S
Mol. Mass.:
390.457
SMILES:
NS(=O)(=O)c1ccc(CNC(=O)CCCNC(=O)Nc2ccccc2)cc1
: