Target
Carbonic anhydrase 7
Ligand
BDBM50040430
Substrate
Meas. Tech.
ChEMBL_1443937 (CHEMBL3374777)
Ki
29±n/a nM
Citation
 Ceruso, MAntel, SVullo, DScozzafava, ASupuran, CT Inhibition studies of new ureido-substituted sulfonamides incorporating a GABA moiety against human carbonic anhydrase isoforms I-XIV. Bioorg Med Chem 22:6768-75 (2015)  
Target
Name:
Carbonic anhydrase 7
Synonyms:
CA-VII CAH7_HUMAN Carbonic anhydrase Carbonic anhydrase VII (CA VII)
Type:
Enzyme
Mol. Mass.:
29664.11
Organism:
Homo sapiens (Human)
Description:
Human cloned isozyme.
Residue:
264
  
Inhibitor
Name:
BDBM50040430
Synonyms:
CHEMBL3360589
Type:
Small organic molecule
Emp. Form.:
C20H26N4O4S
Mol. Mass.:
418.51
SMILES:
NS(=O)(=O)c1ccc(CCNC(=O)CCCNC(=O)NCc2ccccc2)cc1
: