Target
Carbonic anhydrase 12
Ligand
BDBM50040427
Substrate
Meas. Tech.
ChEMBL_1443939 (CHEMBL3374779)
Ki
37±n/a nM
Citation
 Ceruso, MAntel, SVullo, DScozzafava, ASupuran, CT Inhibition studies of new ureido-substituted sulfonamides incorporating a GABA moiety against human carbonic anhydrase isoforms I-XIV. Bioorg Med Chem 22:6768-75 (2015)  
Target
Name:
Carbonic anhydrase 12
Synonyms:
CA-XII CAH12_HUMAN Carbonic anhydrase Carbonic anhydrase XII Carbonic anhydrase XII (CAXII) | Tumor antigen HOM-RCC-3.1.3
Type:
Enzyme
Mol. Mass.:
39456.00
Organism:
Homo sapiens (Human)
Description:
Catalytic domain of human cloned isozyme was used in the assay
Residue:
354
  
Inhibitor
Name:
BDBM50040427
Synonyms:
CHEMBL3360586
Type:
Small organic molecule
Emp. Form.:
C18H22N4O4S
Mol. Mass.:
390.457
SMILES:
NS(=O)(=O)c1ccc(CNC(=O)CCCNC(=O)Nc2ccccc2)cc1
: